Target
Sodium-dependent dopamine transporter
Ligand
BDBM50127390
Substrate
Ki
1.38±n/a nM
Comments
PDSP_1634
Citation
 Damaj, MISlemmer, JECarroll, FIMartin, BR Pharmacological characterization of nicotine's interaction with cocaine and cocaine analogs. J Pharmacol Exp Ther 289:1229-36 (1999) Target
Name:
Sodium-dependent dopamine transporter
Synonyms:
DA transporter SC6A3_RAT Sodium-dependent dopamine transporter | Sodium-dependent dopamine transporter (DAT)
Type:
Multi-pass membrane protein
Mol. Mass.:
68749.45
Organism:
Rattus norvegicus (rat)
Description:
P23977
Residue:
619
  
Inhibitor
Name:
BDBM50127390
Synonyms:
CHEMBL51355 [3-(4-Chloro-phenyl)-8-methyl-8-aza-bicyclo[3.2.1]oct-2-yl]-pyrrolidin-1-yl-methanone
Type:
Small organic molecule
Emp. Form.:
C19H25ClN2O
Mol. Mass.:
332.868
SMILES:
CN1[C@@H]2CCC1C([C@H](C2)c1ccc(Cl)cc1)C(=O)N1CCCC1
: