Target
Norepinephrine transporter
Ligand
BDBM50006786
Substrate
Ki
778±n/a nM
Comments
PDSP_1631
Citation
 Damaj, MISlemmer, JECarroll, FIMartin, BR Pharmacological characterization of nicotine's interaction with cocaine and cocaine analogs. J Pharmacol Exp Ther 289:1229-36 (1999) Target
Name:
Norepinephrine transporter
Synonyms:
Type:
Enzyme Catalytic Domain
Mol. Mass.:
2082.45
Organism:
RAT
Description:
Norepinephrine transporter 0 RAT::Q9JIA2
Residue:
19
MLLARMKPQVQPELGGADQ
  
Inhibitor
Name:
BDBM50006786
Synonyms:
3-(4-Chloro-phenyl)-8-methyl-8-aza-bicyclo[3.2.1]octane-2-carboxylic acid isopropyl ester RTI-114
Type:
Small organic molecule
Emp. Form.:
C18H24ClNO2
Mol. Mass.:
321.842
SMILES:
CC(C)OC(=O)[C@@H]1C2CC[C@H](C[C@@H]1c1ccc(Cl)cc1)N2C
: