Target
Trypanothione reductase
Ligand
BDBM50241641
Substrate
Meas. Tech.
Inhibition Assay
pH
7.8±0
Temperature
298.15±0 K
IC50
5.5e+4±n/a nM
Citation
 Fournet, AInchausti, AYaluff, GRojas De Arias, AGuinaudeau, HBruneton, JBreidenbach, MAKarplus, PAFaerman, CH Trypanocidal bisbenzylisoquinoline alkaloids are inhibitors of trypanothione reductase. J Enzym Inhib 13:1-9 (1998)  
Target
Name:
Trypanothione reductase
Synonyms:
N(1),N(8)-bis(glutathionyl)spermidine reductase TYTR_CRIFA | Trypanothione Reductase (TR)
Type:
Protein
Mol. Mass.:
53225.75
Organism:
Crithidia fasciculata
Description:
P39040
Residue:
491
  
Inhibitor
Name:
BDBM50241641
Synonyms:
(+)-Homoaromoline Homoaromoline | Limacusine (R,S)
Type:
Small organic molecule
Emp. Form.:
C37H40N2O6
Mol. Mass.:
608.7233
SMILES:
COc1ccc2C[C@H]3N(C)CCc4cc(OC)c(Oc5c(O)c(OC)cc6CCN(C)[C@@H](Cc7ccc(Oc1c2)cc7)c56)cc34
: