Target
Bombesin receptor subtype-3
Ligand
BDBM85499
Substrate
Ki
6900±n/a nM
Comments
PDSP_1587
Citation
 Katsuno, TPradhan, TKRyan, RRMantey, SAHou, WDonohue, PJAkeson, MASpindel, ERBattey, JFCoy, DHJensen, RT Pharmacology and cell biology of the bombesin receptor subtype 4 (BB4-R). Biochemistry 38:7307-20 (1999)  
Target
Name:
Bombesin receptor subtype-3
Synonyms:
BRS-3 BRS3_HUMAN Bombesin like receptor 3
Type:
Enzyme Catalytic Domain
Mol. Mass.:
44424.45
Organism:
Homo sapiens (Human)
Description:
Bombesin 3 BRS3 HUMAN::P32247
Residue:
399
  
Inhibitor
Name:
BDBM85499
Synonyms:
CAS_29451-71-6 Ranatensin
Type:
Small organic molecule
Emp. Form.:
C61H84N16O13S
Mol. Mass.:
1281.484
SMILES:
CSCCC(NC(=O)C(Cc1ccccc1)NC(=O)C(Cc1cnc[nH]1)NC(=O)CNC(=O)C(NC(=O)C(C)NC(=O)C(Cc1c[nH]c2ccccc12)NC(=O)C(CCC(N)=O)NC(=O)C1CCCN1C(=O)C(NC(=O)C1CCC(=O)N1)C(C)C)C(C)C)C(N)=O
: