Target
Gastrin-releasing peptide receptor
Ligand
BDBM85494
Substrate
Ki
27±n/a nM
Comments
PDSP_751
Citation
 Katsuno, TPradhan, TKRyan, RRMantey, SAHou, WDonohue, PJAkeson, MASpindel, ERBattey, JFCoy, DHJensen, RT Pharmacology and cell biology of the bombesin receptor subtype 4 (BB4-R). Biochemistry 38:7307-20 (1999)  
Target
Name:
Gastrin-releasing peptide receptor
Synonyms:
GRPR_RAT Gastrin-releasing peptide receptor | Grpr
Type:
Enzyme Catalytic Domain
Mol. Mass.:
43227.55
Organism:
RAT
Description:
Gastrin-Releasing peptide 0 RAT::P52500
Residue:
384
  
Inhibitor
Name:
BDBM85494
Synonyms:
DPhe6-Bn(6-13)NH2
Type:
Small organic molecule
Emp. Form.:
C47H65N13O9
Mol. Mass.:
956.1007
SMILES:
CC(C)C[C@H](NC(=O)[C@H](Cc1cnc[nH]1)NC(=O)CNC(=O)[C@@H](NC(=O)[C@H](C)NC(=O)[C@H](Cc1c[nH]c2ccccc12)NC(=O)[C@H](CCC(N)=O)NC(=O)[C@H](N)Cc1ccccc1)C(C)C)C(N)=O
: