Target
Neuromedin-B receptor
Ligand
BDBM85491
Substrate
Ki
>10000±n/a nM
Comments
PDSP_1065
Citation
 Katsuno, TPradhan, TKRyan, RRMantey, SAHou, WDonohue, PJAkeson, MASpindel, ERBattey, JFCoy, DHJensen, RT Pharmacology and cell biology of the bombesin receptor subtype 4 (BB4-R). Biochemistry 38:7307-20 (1999)  
Target
Name:
Neuromedin-B receptor
Synonyms:
NMB Neuromedin B receptor Nmbr
Type:
Enzyme Catalytic Domain
Mol. Mass.:
43540.92
Organism:
RAT
Description:
NMB 0 RAT::P24053
Residue:
390
  
Inhibitor
Name:
BDBM85491
Synonyms:
Leu13,Psi(CH2NH),Leu14-BN
Type:
Small organic molecule
Emp. Form.:
C72H114N24O17
Mol. Mass.:
1587.8262
SMILES:
CC(C)C[C@@H](CN[C@@H](CC(C)C)C(N)=O)NC(=O)[C@H](Cc1cnc[nH]1)NC(=O)CNC(=O)[C@@H](NC(=O)[C@H](C)NC(=O)[C@H](Cc1c[nH]c2ccccc12)NC(=O)[C@H](CCC(N)=O)NC(=O)[C@H](CC(N)=O)NC(=O)CNC(=O)[C@H](CC(C)C)NC(=O)[C@H](CCCN=C(N)N)NC(=O)[C@H](CCC(N)=O)NC(=O)[C@@H]1CCC(=O)N1)C(C)C
: