Target
Neuromedin-B receptor
Ligand
BDBM85498
Substrate
Ki
7±n/a nM
Comments
PDSP_1082
Citation
 Katsuno, TPradhan, TKRyan, RRMantey, SAHou, WDonohue, PJAkeson, MASpindel, ERBattey, JFCoy, DHJensen, RT Pharmacology and cell biology of the bombesin receptor subtype 4 (BB4-R). Biochemistry 38:7307-20 (1999)  
Target
Name:
Neuromedin-B receptor
Synonyms:
NMB Neuromedin B receptor Nmbr
Type:
Enzyme Catalytic Domain
Mol. Mass.:
43540.92
Organism:
RAT
Description:
NMB 0 RAT::P24053
Residue:
390
  
Inhibitor
Name:
BDBM85498
Synonyms:
CAS_5486808 NSC_5486808
Type:
Small organic molecule
Emp. Form.:
C51H68N14O11S
Mol. Mass.:
1085.238
SMILES:
CSCCC(NC(=O)C(Cc1ccccc1)NC(=O)C(Cc1cnc[nH]1)NC(=O)CNC(=O)C(NC(=O)C(C)NC(=O)C(Cc1c[nH]c2ccccc12)NC(=O)C(CCC(N)=O)NC(=O)C1CCC(=O)N1)C(C)C)C(N)=O
: