Target
Enoyl-[acyl-carrier-protein] reductase [NADPH] FabI
Ligand
BDBM275884
Substrate
Meas. Tech.
Tight-binding assay
pH
7.5±n/a
Ki
116±4.6 nM
Comments
extracted
Citation
 Tonge, PPan, P Pyridone FabI inhibitors and uses thereof US Patent  US10071965 Publication Date 9/11/2018 
Target
Name:
Enoyl-[acyl-carrier-protein] reductase [NADPH] FabI
Synonyms:
Enoyl-ACP Reductase (FabI) FABI_STAAR fabI | trans-2-enoyl-[acyl carrier protein] reductase
Type:
Enzyme
Mol. Mass.:
27989.00
Organism:
Staphylococcus aureus
Description:
Q6GI75
Residue:
256
  
Inhibitor
Name:
BDBM275884
Synonyms:
US10071965, Compound PT171
Type:
Small organic molecule
Emp. Form.:
C15H17NO
Mol. Mass.:
227.3016
SMILES:
CCc1ccn(Cc2ccccc2C)c(=O)c1
: