Target
Prostaglandin G/H synthase 1
Ligand
BDBM50090676
Substrate
Ki
1100±n/a nM
Comments
PDSP_4463
Citation
 Warner, TDGiuliano, FVojnovic, IBukasa, AMitchell, JAVane, JR Nonsteroid drug selectivities for cyclo-oxygenase-1 rather than cyclo-oxygenase-2 are associated with human gastrointestinal toxicity: a full in vitro analysis. Proc Natl Acad Sci U S A 96:7563-8 (1999)  
Target
Name:
Prostaglandin G/H synthase 1
Synonyms:
COX-1 Cyclooxygenase Cyclooxygenase-1 (COX-1) PTGS1 | Prostaglandin G/H synthase (cyclooxygenase)
Type:
Enzyme
Mol. Mass.:
68692.62
Organism:
Homo sapiens (Human)
Description:
P23219
Residue:
599
  
Inhibitor
Name:
BDBM50090676
Synonyms:
(+-)-2-(p-(2-thenoyl)phenyl)propionic acid 2-[4-(thiophen-2-ylcarbonyl)phenyl]propanoic acid CHEMBL956 alpha-methyl-4-(2-thienylcarbonyl)benzeneacetic acid | p-2-thenoylhydratropic acid
Type:
Small organic molecule
Emp. Form.:
C14H12O3S
Mol. Mass.:
260.308
SMILES:
CC(C(O)=O)c1ccc(cc1)C(=O)c1cccs1
: