Target
Prostaglandin G/H synthase 2
Ligand
BDBM50097125
Substrate
Ki
>10000±n/a nM
Comments
PDSP_4481
Citation
 Warner, TDGiuliano, FVojnovic, IBukasa, AMitchell, JAVane, JR Nonsteroid drug selectivities for cyclo-oxygenase-1 rather than cyclo-oxygenase-2 are associated with human gastrointestinal toxicity: a full in vitro analysis. Proc Natl Acad Sci U S A 96:7563-8 (1999)  
Target
Name:
Prostaglandin G/H synthase 2
Synonyms:
COX2 Cyclooxygenase 2 (COX-2) Cyclooxygenase-2 (COX-2 AA) Cyclooxygenase-2 (COX-2) PGH2_HUMAN PHS II Prostaglandin E synthase/G/H synthase 2 Prostaglandin-endoperoxide synthase 2
Type:
Enzyme
Mol. Mass.:
69003.89
Organism:
Homo sapiens (Human)
Description:
Recombinant Cox-2 provided by Cayman (Cayman Chemical Co.,Ann Arbor, MI).
Residue:
604
  
Inhibitor
Name:
BDBM50097125
Synonyms:
2-Hydroxy-5-((4-((2-pyridinylamino)sulfonyl)phenyl)azo)benzoic acid 4-(Pyridyl-2-amidosulfonyl)-3'-carboxy-4'-hydroxyazobenzene 5-(4-(2-Pyridylsulfamoyl)phenylazo)-2-hydroxybenzoic acid Salazosulfapyridine Sulfasalazine
Type:
Small organic molecule
Emp. Form.:
C18H14N4O5S
Mol. Mass.:
398.393
SMILES:
OC(=O)c1cc(ccc1O)N=Nc1ccc(cc1)S(=O)(=O)Nc1ccccn1
: