Target
Sodium-dependent noradrenaline transporter
Ligand
BDBM50010859
Substrate
Ki
93.6±n/a nM
Comments
PDSP_973
Citation
 Paczkowski, FABryan-Lluka, LJPörzgen, PBrüss, MBönisch, H Comparison of the pharmacological properties of cloned rat, human, and bovine norepinephrine transporters. J Pharmacol Exp Ther 290:761-7 (1999) Target
Name:
Sodium-dependent noradrenaline transporter
Synonyms:
NORADR SC6A2_BOVIN Sodium-dependent noradrenaline transporter
Type:
Enzyme Catalytic Domain
Mol. Mass.:
68909.35
Organism:
BOVINE
Description:
Norepinephrine transporter 0 BOVINE::P51143
Residue:
615
  
Inhibitor
Name:
BDBM50010859
Synonyms:
CHEMBL11 IMIPRAMINE PAMOATE | Imipramin
Type:
Small organic molecule
Emp. Form.:
C19H24N2
Mol. Mass.:
280.4073
SMILES:
CN(C)CCCN1c2ccccc2CCc2ccccc12
: