Target
Norepinephrine transporter
Ligand
BDBM22417
Substrate
Ki
5.74±n/a nM
Comments
PDSP_1330
Citation
 Paczkowski, FABryan-Lluka, LJPörzgen, PBrüss, MBönisch, H Comparison of the pharmacological properties of cloned rat, human, and bovine norepinephrine transporters. J Pharmacol Exp Ther 290:761-7 (1999) Target
Name:
Norepinephrine transporter
Synonyms:
Type:
Enzyme Catalytic Domain
Mol. Mass.:
2082.45
Organism:
RAT
Description:
Norepinephrine transporter 0 RAT::Q9JIA2
Residue:
19
MLLARMKPQVQPELGGADQ
  
Inhibitor
Name:
BDBM22417
Synonyms:
3-(2-methoxyphenoxy)-N-methyl-3-phenylpropan-1-amine LY 135252 LY135252 Nisoxetine US9944618, Compound ID No. 177 [3H]Nisoxetine
Type:
radiolabeled ligand
Emp. Form.:
C17H21NO2
Mol. Mass.:
271.3541
SMILES:
CNCCC(Oc1ccccc1OC)c1ccccc1
: