Target
Somatostatin receptor type 4
Ligand
BDBM275929
Substrate
Meas. Tech.
cAMP Assay
pH
7.4±n/a
Temperature
298.15±n/a K
EC50
0.700±n/a nM
Comments
extracted
Citation
 Mazzaferro, RFerrara, MGiovannini, RLingard, IRudolf, K Morpholine and 1,4-oxazepane amides as somatostatin receptor subtype 4 (SSTR4) agonists US Patent  US10071974 Publication Date 9/11/2018 
Target
Name:
Somatostatin receptor type 4
Synonyms:
SOMATOSTATIN SST4 SS4-R SSR4_HUMAN SSTR4 | Somatostatin receptor type 4 (SSTR4)
Type:
Enzyme
Mol. Mass.:
42015.38
Organism:
Homo sapiens (Human)
Description:
P31391
Residue:
388
  
Inhibitor
Name:
BDBM275929
Synonyms:
US10071974, Example 40 US10071974, Example 42 | US10577336, Example 42
Type:
Small organic molecule
Emp. Form.:
C19H25N3O2
Mol. Mass.:
327.4207
SMILES:
Cc1ncc(c2ccccc12)C(C)(C)NC(=O)C1CNCCOC1
: