Target
Somatostatin receptor type 4
Ligand
BDBM275954
Substrate
Meas. Tech.
cAMP Assay
pH
7.4±n/a
Temperature
298.15±n/a K
EC50
23000±n/a nM
Comments
extracted
Citation
 Mazzaferro, RFerrara, MGiovannini, RLingard, IRudolf, K Morpholine and 1,4-oxazepane amides as somatostatin receptor subtype 4 (SSTR4) agonists US Patent  US10071974 Publication Date 9/11/2018 
Target
Name:
Somatostatin receptor type 4
Synonyms:
SOMATOSTATIN SST4 SS4-R SSR4_HUMAN SSTR4 | Somatostatin receptor type 4 (SSTR4)
Type:
Enzyme
Mol. Mass.:
42015.38
Organism:
Homo sapiens (Human)
Description:
P31391
Residue:
388
  
Inhibitor
Name:
BDBM275954
Synonyms:
US10071974, Example 65 US10071974, Example 67 | US10577336, Example 67
Type:
Small organic molecule
Emp. Form.:
C16H20FN3O3
Mol. Mass.:
321.3467
SMILES:
CC(C)(NC(=O)C1CNCCCO1)c1noc2c(F)cccc12
: