Target
Somatostatin receptor type 4
Ligand
BDBM275981
Substrate
Meas. Tech.
cAMP Assay
pH
7.4±n/a
Temperature
298.15±n/a K
EC50
2.50±n/a nM
Comments
extracted
Citation
 Mazzaferro, RFerrara, MGiovannini, RLingard, IRudolf, K Morpholine and 1,4-oxazepane amides as somatostatin receptor subtype 4 (SSTR4) agonists US Patent  US10071974 Publication Date 9/11/2018 
Target
Name:
Somatostatin receptor type 4
Synonyms:
SOMATOSTATIN SST4 SS4-R SSR4_HUMAN SSTR4 | Somatostatin receptor type 4 (SSTR4)
Type:
Enzyme
Mol. Mass.:
42015.38
Organism:
Homo sapiens (Human)
Description:
P31391
Residue:
388
  
Inhibitor
Name:
BDBM275981
Synonyms:
US10071974, Example 92 US10071974, Example 94 | US10577336, Example 94
Type:
Small organic molecule
Emp. Form.:
C16H21ClN4O2
Mol. Mass.:
336.817
SMILES:
CC(C)(NC(=O)C1CNCCOC1)c1n[nH]c2c(Cl)cccc12
: