Target
Somatostatin receptor type 1
Ligand
BDBM275909
Substrate
Meas. Tech.
Radioligand Binding Assays
Temperature
298.15±n/a K
Ki
9450±n/a nM
Comments
extracted
Citation
 Mazzaferro, RFerrara, MGiovannini, RLingard, IRudolf, K Morpholine and 1,4-oxazepane amides as somatostatin receptor subtype 4 (SSTR4) agonists US Patent  US10071974 Publication Date 9/11/2018 
Target
Name:
Somatostatin receptor type 1
Synonyms:
SOMATOSTATIN SST1 SS-1-R SS1R SSTR1 | Somatostatin receptor type 1 (SSTR1)
Type:
Enzyme
Mol. Mass.:
42692.81
Organism:
Homo sapiens (Human)
Description:
P30872
Residue:
391
  
Inhibitor
Name:
BDBM275909
Synonyms:
US10071974, Example 20 US10071974, Example 22 | US10577336, Example 22
Type:
Small organic molecule
Emp. Form.:
C17H24N4O2
Mol. Mass.:
316.3981
SMILES:
Cn1nc(c2ccccc12)C(C)(C)NC(=O)C1CNCCOC1
: