Target
Somatostatin receptor type 2
Ligand
BDBM275909
Substrate
Meas. Tech.
Radioligand Binding Assays
Temperature
298.15±n/a K
Ki
9600±n/a nM
Comments
extracted
Citation
 Mazzaferro, RFerrara, MGiovannini, RLingard, IRudolf, K Morpholine and 1,4-oxazepane amides as somatostatin receptor subtype 4 (SSTR4) agonists US Patent  US10071974 Publication Date 9/11/2018 
Target
Name:
Somatostatin receptor type 2
Synonyms:
SOMATOSTATIN SST2 SS-2-R SS2R SSTR2 | Somatostatin receptor type 2 (SSTR2)
Type:
Enzyme
Mol. Mass.:
41344.94
Organism:
Homo sapiens (Human)
Description:
P30874
Residue:
369
  
Inhibitor
Name:
BDBM275909
Synonyms:
US10071974, Example 20 US10071974, Example 22 | US10577336, Example 22
Type:
Small organic molecule
Emp. Form.:
C17H24N4O2
Mol. Mass.:
316.3981
SMILES:
Cn1nc(c2ccccc12)C(C)(C)NC(=O)C1CNCCOC1
: