Target
Somatostatin receptor type 3
Ligand
BDBM275912
Substrate
Meas. Tech.
Radioligand Binding Assays
Temperature
298.15±n/a K
Ki
8620±n/a nM
Comments
extracted
Citation
 Mazzaferro, RFerrara, MGiovannini, RLingard, IRudolf, K Morpholine and 1,4-oxazepane amides as somatostatin receptor subtype 4 (SSTR4) agonists US Patent  US10071974 Publication Date 9/11/2018 
Target
Name:
Somatostatin receptor type 3
Synonyms:
SOMATOSTATIN SST3 SS3-R SSR-28 SSTR3 | Somatostatin receptor type 3 (SSTR3)
Type:
Protein
Mol. Mass.:
45855.97
Organism:
Homo sapiens (Human)
Description:
P32745
Residue:
418
  
Inhibitor
Name:
BDBM275912
Synonyms:
US10071974, Example 23 US10071974, Example 25 | US10577336, Example 25
Type:
Small organic molecule
Emp. Form.:
C17H24N4O2
Mol. Mass.:
316.3981
SMILES:
Cn1nc(c2ccccc12)C(C)(C)NC(=O)C1CNCCCO1
: