Target
Adenosine receptor A1
Ligand
BDBM50034533
Substrate
Ki
12±n/a nM
Comments
PDSP_8
Citation
 Klotz, KNCamaioni, EVolpini, RKachler, SVittori, SCristalli, G 2-Substituted N-ethylcarboxamidoadenosine derivatives as high-affinity agonists at human A3 adenosine receptors. Naunyn Schmiedebergs Arch Pharmacol 360:103-8 (1999)  
Target
Name:
Adenosine receptor A1
Synonyms:
A1 adenosine receptor (hA1) AA1R_HUMAN ADORA1 Adenosine A1-receptor Adenosine receptor A1 (hA1) | Adenosine transporter (AdT)
Type:
G Protein-Coupled Receptor (GPCR)
Mol. Mass.:
36520.92
Organism:
Homo sapiens (Human)
Description:
P30542
Residue:
326
  
Inhibitor
Name:
BDBM50034533
Synonyms:
2-substituted NECA derivatives, 11 5-{6-amino-2-[2-(1,3-thiazol-2-yl)ethynyl]-9H-purin-9-yl}-N-ethyl-3,4-dihydroxyoxolane-2-carboxamide
Type:
Small organic molecule
Emp. Form.:
C17H17N7O4S
Mol. Mass.:
415.426
SMILES:
CCNC(=O)C1OC(C(O)C1O)n1cnc2c(N)nc(nc12)C#Cc1nccs1
: