Target
Adenosine receptor A1
Ligand
BDBM50041894
Substrate
Ki
87±n/a nM
Comments
PDSP_9
Citation
 Klotz, KNCamaioni, EVolpini, RKachler, SVittori, SCristalli, G 2-Substituted N-ethylcarboxamidoadenosine derivatives as high-affinity agonists at human A3 adenosine receptors. Naunyn Schmiedebergs Arch Pharmacol 360:103-8 (1999)  
Target
Name:
Adenosine receptor A1
Synonyms:
A1 adenosine receptor (hA1) AA1R_HUMAN ADORA1 Adenosine A1-receptor Adenosine receptor A1 (hA1) | Adenosine transporter (AdT)
Type:
G Protein-Coupled Receptor (GPCR)
Mol. Mass.:
36520.92
Organism:
Homo sapiens (Human)
Description:
P30542
Residue:
326
  
Inhibitor
Name:
BDBM50041894
Synonyms:
2-substituted NECA derivatives, 12 | 5-(6-Amino-2-cyclohex-1-enylethynyl-purin-9-yl)-3,4-dihydroxy-tetrahydro-furan-2-carboxylic acid ethylamide
Type:
Small organic molecule
Emp. Form.:
C20H24N6O4
Mol. Mass.:
412.4424
SMILES:
CCNC(=O)C1OC(C(O)C1O)n1cnc2c(N)nc(nc12)C#CC1=CCCCC1
: