Target
Adenosine receptor A3
Ligand
BDBM21190
Substrate
Ki
269±n/a nM
Comments
PDSP_2329
Citation
 Linden, JThai, TFigler, HJin, XRobeva, AS Characterization of human A(2B) adenosine receptors: radioligand binding, western blotting, and coupling to G(q) in human embryonic kidney 293 cells and HMC-1 mast cells. Mol Pharmacol 56:705-13 (1999) Target
Name:
Adenosine receptor A3
Synonyms:
A3 adenosine receptor (hA3) ADORA3 | Adenosine A3 receptor (A3AR)
Type:
G Protein-Coupled Receptor (GPCR)
Mol. Mass.:
36197.32
Organism:
Homo sapiens (Human)
Description:
P0DMS8
Residue:
318
  
Inhibitor
Name:
BDBM21190
Synonyms:
4-(2-{[5-amino-2-(furan-2-yl)-[1,2,4]triazolo[1,5-a][1,3,5]triazin-7-yl]amino}ethyl)phenol ZM 241385 [3H]-ZM241385
Type:
Small organic molecule
Emp. Form.:
C16H15N7O2
Mol. Mass.:
337.336
SMILES:
Nc1nc(NCCc2ccc(O)cc2)nc2nc(nn12)-c1ccco1
: