Target
5-hydroxytryptamine receptor 2B
Ligand
BDBM50007406
Substrate
Ki
288.40±n/a nM
Comments
PDSP_1808
Citation
 Porter, RHBenwell, KRLamb, HMalcolm, CSAllen, NHRevell, DFAdams, DRSheardown, MJ Functional characterization of agonists at recombinant human 5-HT2A, 5-HT2B and 5-HT2C receptors in CHO-K1 cells. Br J Pharmacol 128:13-20 (1999)  
Target
Name:
5-hydroxytryptamine receptor 2B
Synonyms:
5-HT-2B 5-hydroxytryptamine (serotonin) receptor 2B [Homo sapiens] 5-hydroxytryptamine receptor 2C (5HT2C) HTR2B Serotonin 2b (5-HT2b) receptor | Serotonin Receptor 2B
Type:
G Protein-Coupled Receptor (GPCR)
Mol. Mass.:
54312.47
Organism:
Homo sapiens (Human)
Description:
Receptor binding assays were performed using human clone stably expressed in CHO cells.
Residue:
481
  
Inhibitor
Name:
BDBM50007406
Synonyms:
1-(3-(trifluoromethyl)phenyl)piperazine 1-(3-Trifluoromethyl-phenyl)-piperazine(TFMPP) TFMPP
Type:
Small organic molecule
Emp. Form.:
C11H13F3N2
Mol. Mass.:
230.2295
SMILES:
FC(F)(F)c1cccc(c1)N1CCNCC1
: