Target
Angiotensin-converting enzyme 2
Ligand
BDBM85549
Substrate
Ki
13.7±n/a nM
Comments
PDSP_1338
Citation
 Handa, RKHarding, JWSimasko, SM Characterization and function of the bovine kidney epithelial angiotensin receptor subtype 4 using angiotensin IV and divalinal angiotensin IV as receptor ligands. J Pharmacol Exp Ther 291:1242-9 (1999) Target
Name:
Angiotensin-converting enzyme 2
Synonyms:
ACE2 Angiotensin IV
Type:
Enzyme Catalytic Domain
Mol. Mass.:
93046.63
Organism:
BOVINE
Description:
Angiotensin IV 0 BOVINE::Q58DD0
Residue:
804
  
Inhibitor
Name:
BDBM85549
Synonyms:
NleYI-6-hexamide
Type:
Small organic molecule
Emp. Form.:
C21H34N4O3
Mol. Mass.:
390.5197
SMILES:
CCCC[C@H](N)C(=O)N[C@H](Cc1ccccc1)C(=O)NCCCCCC(N)=O
: