Target
Tyrosine-protein kinase transforming protein Src
Ligand
BDBM3353
Substrate
poly(E,Y)
Meas. Tech.
Kinase Inhibition Assay
IC50
2400±n/a nM
Citation
 Showalter, HDSercel, ADLeja, BMWolfangel, CDAmbroso, LAElliott, WLFry, DWKraker, AJHoward, CTLu, GHMoore, CWNelson, JMRoberts, BJVincent, PWDenny, WAThompson, AM Tyrosine kinase inhibitors. 6. Structure-activity relationships among N- and 3-substituted 2,2'-diselenobis(1H-indoles) for inhibition of protein tyrosine kinases and comparative in vitro and in vivo studies against selected sulfur congeners. J Med Chem 40:413-26 (1997)  
Target
Name:
Tyrosine-protein kinase transforming protein Src
Synonyms:
P60-Src V-SRC | pp60v-src
Type:
Enzyme
Mol. Mass.:
58884.32
Organism:
Avian sarcoma virus
Description:
P00525
Residue:
526
  
Inhibitor
Name:
BDBM3353
Synonyms:
2,2 -Diselenobis[1-methyl-1H-indole-3-carboxylic acid] diselenobis(1H-indole) deriv. 22
Type:
Small organic molecule
Emp. Form.:
C20H16N2O4Se2
Mol. Mass.:
506.27
SMILES:
Cn1c([Se][Se]c2c(C(O)=O)c3ccccc3n2C)c(C(O)=O)c2ccccc12
:
Substrate
Name:
poly(E,Y)
Synonyms:
Type:
Random Polymer
Mol. Mass.:
358.43
Organism:
Description:
poly[(glu)4(tyr)l].
Residue:
3
NA