Target
5-hydroxytryptamine receptor 2C
Ligand
BDBM50001915
Substrate
Ki
20±n/a nM
Comments
PDSP_1168
Citation
 Egan, CGrinde, EDupre, ARoth, BLHake, MTeitler, MHerrick-Davis, K Agonist high and low affinity state ratios predict drug intrinsic activity and a revised ternary complex mechanism at serotonin 5-HT(2A) and 5-HT(2C) receptors. Synapse 35:144-50 (2000)  
Target
Name:
5-hydroxytryptamine receptor 2C
Synonyms:
5-HT2C 5-hydroxytryptamine receptor 2C (5HT2c) 5ht1c Htr2c Serotonin receptor 2a and 2c (5HT2A and 5HT2C)
Type:
Enzyme
Mol. Mass.:
51935.10
Organism:
Rattus norvegicus (Rat)
Description:
P08909
Residue:
460
  
Inhibitor
Name:
BDBM50001915
Synonyms:
1-(3-chlorophenyl)piperazine m-Chlorophenylpiperazine | mCPP
Type:
Small organic molecule
Emp. Form.:
C10H13ClN2
Mol. Mass.:
196.677
SMILES:
Clc1cccc(c1)N1CCNCC1
: