Target
5-hydroxytryptamine receptor 2A
Ligand
BDBM85598
Substrate
Ki
267±n/a nM
Comments
PDSP_1084
Citation
 Fitzgerald, LWBurn, TCBrown, BSPatterson, JPCorjay, MHValentine, PASun, JHLink, JRAbbaszade, IHollis, JMLargent, BLHartig, PRHollis, GFMeunier, PCRobichaud, AJRobertson, DW Possible role of valvular serotonin 5-HT(2B) receptors in the cardiopathy associated with fenfluramine. Mol Pharmacol 57:75-81 (2000) Target
Name:
5-hydroxytryptamine receptor 2A
Synonyms:
5-HT-2 5-HT2A 5-hydroxytryptamine receptor 2A (5HT-2A) 5HT2A_HUMAN HTR2A | Serotonin receptor 2A
Type:
undefined
Mol. Mass.:
52607.65
Organism:
Homo sapiens (Human)
Description:
P28223
Residue:
471
  
Inhibitor
Name:
BDBM85598
Synonyms:
l-norfenfluramine
Type:
Small organic molecule
Emp. Form.:
C10H12F3N
Mol. Mass.:
203.2042
SMILES:
C[C@@H](N)Cc1cccc(c1)C(F)(F)F
: