Target
Prostaglandin F2-alpha receptor
Ligand
BDBM50018531
Substrate
Ki
241±n/a nM
Comments
PDSP_1934
Citation
 Abramovitz, MAdam, MBoie, YCarrière, MDenis, DGodbout, CLamontagne, SRochette, CSawyer, NTremblay, NMBelley, MGallant, MDufresne, CGareau, YRuel, RJuteau, HLabelle, MOuimet, NMetters, KM The utilization of recombinant prostanoid receptors to determine the affinities and selectivities of prostaglandins and related analogs. Biochim Biophys Acta 1483:285-93 (2000)  
Target
Name:
Prostaglandin F2-alpha receptor
Synonyms:
PF2R_HUMAN PGF2 alpha receptor PTGFR Prostanoid FP receptor
Type:
Enzyme
Mol. Mass.:
40072.29
Organism:
Homo sapiens (Human)
Description:
P43088
Residue:
359
  
Inhibitor
Name:
BDBM50018531
Synonyms:
(Z)-7-[(S)-6-((E)-(S)-3-Hydroxy-oct-1-enyl)-2-oxa-bicyclo[2.2.1]hept-5-yl]-hept-5-enoic acid CHEMBL73010 U46619
Type:
Small organic molecule
Emp. Form.:
C21H34O4
Mol. Mass.:
350.4923
SMILES:
CCCCC[C@H](O)\C=C\C1[C@H]2C[C@H](CO2)[C@@H]1C\C=C/CCCC(O)=O
: