Target
Solute carrier organic anion transporter family member 2A1
Ligand
BDBM85601
Substrate
Ki
592±n/a nM
Comments
PDSP_4313
Citation
 Abramovitz, MAdam, MBoie, YCarrière, MDenis, DGodbout, CLamontagne, SRochette, CSawyer, NTremblay, NMBelley, MGallant, MDufresne, CGareau, YRuel, RJuteau, HLabelle, MOuimet, NMetters, KM The utilization of recombinant prostanoid receptors to determine the affinities and selectivities of prostaglandins and related analogs. Biochim Biophys Acta 1483:285-93 (2000)  
Target
Name:
Solute carrier organic anion transporter family member 2A1
Synonyms:
OATP2A1 SLC21A2 SO2A1_HUMAN
Type:
Enzyme Catalytic Domain
Mol. Mass.:
70068.67
Organism:
Homo sapiens (Human)
Description:
Prostaglandin Transporter 0 HUMAN::Q92959
Residue:
643
  
Inhibitor
Name:
BDBM85601
Synonyms:
AH-23848 CAS_54751 | NSC_54751
Type:
Small organic molecule
Emp. Form.:
C29H35NO5
Mol. Mass.:
477.5919
SMILES:
OC(=O)C(CC=C(CCC1CCC(=O)C1)OCc1ccc(cc1)-c1ccccc1)N1CCOCC1
: