Target
Solute carrier organic anion transporter family member 2A1
Ligand
BDBM50101824
Substrate
Ki
>10000±n/a nM
Comments
PDSP_4306
Citation
 Abramovitz, MAdam, MBoie, YCarrière, MDenis, DGodbout, CLamontagne, SRochette, CSawyer, NTremblay, NMBelley, MGallant, MDufresne, CGareau, YRuel, RJuteau, HLabelle, MOuimet, NMetters, KM The utilization of recombinant prostanoid receptors to determine the affinities and selectivities of prostaglandins and related analogs. Biochim Biophys Acta 1483:285-93 (2000)  
Target
Name:
Solute carrier organic anion transporter family member 2A1
Synonyms:
OATP2A1 SLC21A2 SO2A1_HUMAN
Type:
Enzyme Catalytic Domain
Mol. Mass.:
70068.67
Organism:
Homo sapiens (Human)
Description:
Prostaglandin Transporter 0 HUMAN::Q92959
Residue:
643
  
Inhibitor
Name:
BDBM50101824
Synonyms:
7-{(1R,3R)-3-Hydroxy-2-[(E)-(S)-4-hydroxy-4-(1-propyl-cyclobutyl)-but-1-enyl]-5-oxo-cyclopentyl}-heptanoic acid methyl ester Butaprost (Methyl Ester) | CHEMBL432522
Type:
Small organic molecule
Emp. Form.:
C24H40O5
Mol. Mass.:
408.5714
SMILES:
CCCC1(CCC1)[C@@H](O)C\C=C\C1[C@H](O)CC(=O)[C@@H]1CCCCCCC(=O)OC
: