Target
5-hydroxytryptamine receptor 4
Ligand
BDBM29525
Substrate
Ki
0.31±n/a nM
Comments
PDSP_880
Citation
 Bender, EPindon, Avan Oers, IZhang, YBGommeren, WVerhasselt, PJurzak, MLeysen, JLuyten, W Structure of the human serotonin 5-HT4 receptor gene and cloning of a novel 5-HT4 splice variant. J Neurochem 74:478-89 (2000)  
Target
Name:
5-hydroxytryptamine receptor 4
Synonyms:
5-HT-4 5-HT4S 5-HT4b 5-HT4d 5-hydroxytryptamine receptor 4 5HT4R_HUMAN Serotonin (5-HT) receptor Serotonin 4 (5-HT4) receptor | Serotonin Receptor 4
Type:
Enzyme
Mol. Mass.:
43767.54
Organism:
Homo sapiens (Human)
Description:
Q13639
Residue:
388
  
Inhibitor
Name:
BDBM29525
Synonyms:
3H-GR113808 GR 113808 [3H]GR113808
Type:
radiolabeled ligand
Emp. Form.:
C19H27N3O4S
Mol. Mass.:
393.5
SMILES:
Cn1cc(C(=O)OCC2CCN(CCNS(C)(=O)=O)CC2)c2ccccc12
: