Target
5-hydroxytryptamine receptor 4
Ligand
BDBM85607
Substrate
Ki
15.84±n/a nM
Comments
PDSP_1699
Citation
 Bender, EPindon, Avan Oers, IZhang, YBGommeren, WVerhasselt, PJurzak, MLeysen, JLuyten, W Structure of the human serotonin 5-HT4 receptor gene and cloning of a novel 5-HT4 splice variant. J Neurochem 74:478-89 (2000)  
Target
Name:
5-hydroxytryptamine receptor 4
Synonyms:
5-HT-4 5-HT4S 5-HT4b 5-HT4d 5-hydroxytryptamine receptor 4 5HT4R_HUMAN Serotonin (5-HT) receptor Serotonin 4 (5-HT4) receptor | Serotonin Receptor 4
Type:
Enzyme
Mol. Mass.:
43767.54
Organism:
Homo sapiens (Human)
Description:
Q13639
Residue:
388
  
Inhibitor
Name:
BDBM85607
Synonyms:
CAS_189188-57-6 SDZ-HTF919
Type:
Small organic molecule
Emp. Form.:
C15H21N5O2
Mol. Mass.:
303.3595
SMILES:
COc1ccc2[nH]cc(C=NN=C(N)NCCCCO)c2c1
: