Target
5-hydroxytryptamine receptor 7
Ligand
BDBM50130278
Substrate
Ki
10±n/a nM
Comments
PDSP_3798
Citation
 Lovell, PJBromidge, SMDabbs, SDuckworth, DMForbes, ITJennings, AJKing, FDMiddlemiss, DNRahman, SKSaunders, DVCollin, LLHagan, JJRiley, GJThomas, DR A novel, potent, and selective 5-HT(7) antagonist: (R)-3-(2-(2-(4-methylpiperidin-1-yl)ethyl)pyrrolidine-1-sulfonyl) phen ol (SB-269970). J Med Chem 43:342-5 (2000)  
Target
Name:
5-hydroxytryptamine receptor 7
Synonyms:
5-HT-7 5-HT7 5-HT7S 5HT7 HTR7 | Serotonin receptor 7
Type:
G Protein-Coupled Receptor (GPCR)
Mol. Mass.:
53573.08
Organism:
Homo sapiens (Human)
Description:
P34969
Residue:
479
  
Inhibitor
Name:
BDBM50130278
Synonyms:
(R)-4-Methyl-1-(2-(1-(naphthalene-1-sulfonyl)-pyrrolidin-2-yl)-ethyl)-piperidine(10) 4-Methyl-1-{2-[(R)-1-(naphthalene-1-sulfonyl)-pyrrolidin-2-yl]-ethyl}-piperidine | CHEMBL94984
Type:
Small organic molecule
Emp. Form.:
C22H30N2O2S
Mol. Mass.:
386.551
SMILES:
CC1CCN(CC[C@H]2CCCN2S(=O)(=O)c2cccc3ccccc23)CC1
: