Target
Lysine-specific demethylase 2B
Ligand
BDBM276043
Substrate
Meas. Tech.
FBXL10 Assay
Temperature
298.15±n/a K
IC50
<100±n/a nM
Comments
extracted
Citation
 Chen, YKNie, ZStafford, JAVeal, JM Histone demethylase inhibitors US Patent  US10071984 Publication Date 9/11/2018 
Target
Name:
Lysine-specific demethylase 2B
Synonyms:
AA 1-650 FBL10 Homo sapiens lysine demethylase 2B (KDM2B) KDM2B Lysine-specific demethylase 2B NDY1 PCCX2
Type:
Enzyme Catalytic Domain
Mol. Mass.:
152658.35
Organism:
Homo sapiens (Human)
Description:
Q8NHM5
Residue:
1336
  
Inhibitor
Name:
BDBM276043
Synonyms:
2-[1-(1-phenylethyl)imidazol-4-yl]-4-(1H-triazol-4-yl)pyridine US10174003, Example 5 | US9896436, Example 5
Type:
Small organic molecule
Emp. Form.:
C18H16N6
Mol. Mass.:
316.3598
SMILES:
CC(c1ccccc1)n1cnc(c1)-c1cc(ccn1)-c1c[nH]nn1
: