Target
Lysine-specific demethylase 2A
Ligand
BDBM276045
Substrate
Meas. Tech.
FBXL11 Assay
Temperature
298.15±n/a K
IC50
<100±n/a nM
Comments
extracted
Citation
 Chen, YKNie, ZStafford, JAVeal, JM Histone demethylase inhibitors US Patent  US10071984 Publication Date 9/11/2018 
Target
Name:
Lysine-specific demethylase 2A
Synonyms:
AA1-1162 F-box and leucine-rich repeat protein 11 FBL7 Homo sapiens lysine demethylase 2A (KDM2A) KDM2A KIAA1004 Lysine-specific demethylase 2A (KDM2A) | NM_012308
Type:
Enzyme Catalytic Domain
Mol. Mass.:
132809.04
Organism:
Homo sapiens (Human)
Description:
Residue:
1162
  
Inhibitor
Name:
BDBM276045
Synonyms:
2-[1-[2-(2-methoxyphenyl)ethyl]imidazol-4-yl]-4-(1H-triazol-4-yl)pyridine US10174003, Example 7 | US9896436, Example 7
Type:
Small organic molecule
Emp. Form.:
C19H18N6O
Mol. Mass.:
346.3858
SMILES:
COc1ccccc1CCn1cnc(c1)-c1cc(ccn1)-c1c[nH]nn1
: