Target
Isoform 2 of Histone lysine demethylase PHF8 (2)
Ligand
BDBM276045
Substrate
Meas. Tech.
PHF8 Assay
Temperature
298.15±n/a K
IC50
550±n/a nM
Comments
extracted
Citation
 Chen, YKNie, ZStafford, JAVeal, JM Histone demethylase inhibitors US Patent  US10071984 Publication Date 9/11/2018 
Target
Name:
Isoform 2 of Histone lysine demethylase PHF8 (2)
Synonyms:
Histone lysine demethylase PHF8 (2) NP_055922 PHF8_HUMAN histone lysine demethylase PHF8 isoform 2
Type:
Enzyme Catalytic Domain
Mol. Mass.:
113932.27
Organism:
Homo sapiens (Human)
Description:
Q9UPP1-2
Residue:
1024
  
Inhibitor
Name:
BDBM276045
Synonyms:
2-[1-[2-(2-methoxyphenyl)ethyl]imidazol-4-yl]-4-(1H-triazol-4-yl)pyridine US10174003, Example 7 | US9896436, Example 7
Type:
Small organic molecule
Emp. Form.:
C19H18N6O
Mol. Mass.:
346.3858
SMILES:
COc1ccccc1CCn1cnc(c1)-c1cc(ccn1)-c1c[nH]nn1
: