Target
Isoform 2 of Histone lysine demethylase PHF8 (2)
Ligand
BDBM276052
Substrate
Meas. Tech.
PHF8 Assay
Temperature
298.15±n/a K
IC50
5500±n/a nM
Comments
extracted
Citation
 Chen, YKNie, ZStafford, JAVeal, JM Histone demethylase inhibitors US Patent  US10071984 Publication Date 9/11/2018 
Target
Name:
Isoform 2 of Histone lysine demethylase PHF8 (2)
Synonyms:
Histone lysine demethylase PHF8 (2) NP_055922 PHF8_HUMAN histone lysine demethylase PHF8 isoform 2
Type:
Enzyme Catalytic Domain
Mol. Mass.:
113932.27
Organism:
Homo sapiens (Human)
Description:
Q9UPP1-2
Residue:
1024
  
Inhibitor
Name:
BDBM276052
Synonyms:
4-[2-[1-[(2,3-dichlorophenyl)methyl]imidazol-4-yl]pyridin-4-yl]-1H-triazole-5-carbonitrile US9896436, Example 14
Type:
Small organic molecule
Emp. Form.:
C18H11Cl2N7
Mol. Mass.:
396.233
SMILES:
Clc1cccc(Cn2cnc(c2)-c2cc(ccn2)-c2nn[nH]c2C#N)c1Cl
: