Target
Isoform 2 of Histone lysine demethylase PHF8 (2)
Ligand
BDBM276059
Substrate
Meas. Tech.
PHF8 Assay
Temperature
298.15±n/a K
IC50
550±n/a nM
Comments
extracted
Citation
 Chen, YKNie, ZStafford, JAVeal, JM Histone demethylase inhibitors US Patent  US10071984 Publication Date 9/11/2018 
Target
Name:
Isoform 2 of Histone lysine demethylase PHF8 (2)
Synonyms:
Histone lysine demethylase PHF8 (2) NP_055922 PHF8_HUMAN histone lysine demethylase PHF8 isoform 2
Type:
Enzyme Catalytic Domain
Mol. Mass.:
113932.27
Organism:
Homo sapiens (Human)
Description:
Q9UPP1-2
Residue:
1024
  
Inhibitor
Name:
BDBM276059
Synonyms:
2-[1-[(2,3-dichlorophenyl)methyl]imidazol-4-yl]-4-(1H-triazol-4-yl)pyridine US10174003, Example 21 | US9896436, Example 21
Type:
Small organic molecule
Emp. Form.:
C17H12Cl2N6
Mol. Mass.:
371.223
SMILES:
Clc1cccc(Cn2cnc(c2)-c2cc(ccn2)-c2c[nH]nn2)c1Cl
: