Target
Lysine-specific demethylase 2B
Ligand
BDBM276067
Substrate
Meas. Tech.
FBXL10 Assay
Temperature
298.15±n/a K
IC50
<100±n/a nM
Comments
extracted
Citation
 Chen, YKNie, ZStafford, JAVeal, JM Histone demethylase inhibitors US Patent  US10071984 Publication Date 9/11/2018 
Target
Name:
Lysine-specific demethylase 2B
Synonyms:
AA 1-650 FBL10 Homo sapiens lysine demethylase 2B (KDM2B) KDM2B Lysine-specific demethylase 2B NDY1 PCCX2
Type:
Enzyme Catalytic Domain
Mol. Mass.:
152658.35
Organism:
Homo sapiens (Human)
Description:
Q8NHM5
Residue:
1336
  
Inhibitor
Name:
BDBM276067
Synonyms:
2-[1-[(3-chloro-2-fluorophenyl)methyl]imidazol-4-yl]-4-(1H-triazol-4-yl)pyridine US10174003, Example 29 | US9896436, Example 29
Type:
Small organic molecule
Emp. Form.:
C17H12ClFN6
Mol. Mass.:
354.769
SMILES:
Fc1c(Cl)cccc1Cn1cnc(c1)-c1cc(ccn1)-c1c[nH]nn1
: