Target
Lysine-specific demethylase 2B
Ligand
BDBM276069
Substrate
Meas. Tech.
FBXL10 Assay
Temperature
298.15±n/a K
IC50
<100±n/a nM
Comments
extracted
Citation
 Chen, YKNie, ZStafford, JAVeal, JM Histone demethylase inhibitors US Patent  US10071984 Publication Date 9/11/2018 
Target
Name:
Lysine-specific demethylase 2B
Synonyms:
AA 1-650 FBL10 Homo sapiens lysine demethylase 2B (KDM2B) KDM2B Lysine-specific demethylase 2B NDY1 PCCX2
Type:
Enzyme Catalytic Domain
Mol. Mass.:
152658.35
Organism:
Homo sapiens (Human)
Description:
Q8NHM5
Residue:
1336
  
Inhibitor
Name:
BDBM276069
Synonyms:
4-(1H-triazol-4-yl)-2-[1-[2-[2-(trifluoromethyl)phenyl]ethyl]imidazol-4-yl]pyridine US10174003, Example 31 | US9896436, Example 31
Type:
Small organic molecule
Emp. Form.:
C19H15F3N6
Mol. Mass.:
384.3578
SMILES:
FC(F)(F)c1ccccc1CCn1cnc(c1)-c1cc(ccn1)-c1c[nH]nn1
: