Target
Isoform 2 of Histone lysine demethylase PHF8 (2)
Ligand
BDBM276076
Substrate
Meas. Tech.
PHF8 Assay
Temperature
298.15±n/a K
IC50
>10000±n/a nM
Comments
extracted
Citation
 Chen, YKNie, ZStafford, JAVeal, JM Histone demethylase inhibitors US Patent  US10071984 Publication Date 9/11/2018 
Target
Name:
Isoform 2 of Histone lysine demethylase PHF8 (2)
Synonyms:
Histone lysine demethylase PHF8 (2) NP_055922 PHF8_HUMAN histone lysine demethylase PHF8 isoform 2
Type:
Enzyme Catalytic Domain
Mol. Mass.:
113932.27
Organism:
Homo sapiens (Human)
Description:
Q9UPP1-2
Residue:
1024
  
Inhibitor
Name:
BDBM276076
Synonyms:
4-(5-iodo-1H-triazol-4-yl)-2-[1-(2-naphthalen-1-ylethyl)imidazol-4-yl]pyridine US10174003, Example 38 | US9896436, Example 38
Type:
Small organic molecule
Emp. Form.:
C22H17IN6
Mol. Mass.:
492.3151
SMILES:
Ic1[nH]nnc1-c1ccnc(c1)-c1cn(CCc2cccc3ccccc23)cn1
: