Target
Lysine-specific demethylase 2A
Ligand
BDBM276086
Substrate
Meas. Tech.
FBXL11 Assay
Temperature
298.15±n/a K
IC50
<100±n/a nM
Comments
extracted
Citation
 Chen, YKNie, ZStafford, JAVeal, JM Histone demethylase inhibitors US Patent  US10071984 Publication Date 9/11/2018 
Target
Name:
Lysine-specific demethylase 2A
Synonyms:
AA1-1162 F-box and leucine-rich repeat protein 11 FBL7 Homo sapiens lysine demethylase 2A (KDM2A) KDM2A KIAA1004 Lysine-specific demethylase 2A (KDM2A) | NM_012308
Type:
Enzyme Catalytic Domain
Mol. Mass.:
132809.04
Organism:
Homo sapiens (Human)
Description:
Residue:
1162
  
Inhibitor
Name:
BDBM276086
Synonyms:
1-[(3,4-dichlorophenyl)methyl]-4-{1H-[1,2,3]triazolo[4,5-c]pyridin-6-yl}-1H-imidazole US10174003, Example 48 | US9896436, Example 48
Type:
Small organic molecule
Emp. Form.:
C15H10Cl2N6
Mol. Mass.:
345.186
SMILES:
Clc1ccc(Cn2cnc(c2)-c2cc3[nH]nnc3cn2)cc1Cl
: