Target
Isoform 2 of Histone lysine demethylase PHF8 (2)
Ligand
BDBM276088
Substrate
Meas. Tech.
PHF8 Assay
Temperature
298.15±n/a K
IC50
5500±n/a nM
Comments
extracted
Citation
 Chen, YKNie, ZStafford, JAVeal, JM Histone demethylase inhibitors US Patent  US10071984 Publication Date 9/11/2018 
Target
Name:
Isoform 2 of Histone lysine demethylase PHF8 (2)
Synonyms:
Histone lysine demethylase PHF8 (2) NP_055922 PHF8_HUMAN histone lysine demethylase PHF8 isoform 2
Type:
Enzyme Catalytic Domain
Mol. Mass.:
113932.27
Organism:
Homo sapiens (Human)
Description:
Q9UPP1-2
Residue:
1024
  
Inhibitor
Name:
BDBM276088
Synonyms:
1-(2-chlorophenyl)-4-{1H-[1,2,3]triazolo[4,5-c]pyridin-6-yl}-1H-imidazole US10174003, Example 50 | US9896436, Example 50
Type:
Small organic molecule
Emp. Form.:
C14H9ClN6
Mol. Mass.:
296.714
SMILES:
Clc1ccccc1-n1cnc(c1)-c1cc2[nH]nnc2cn1
: