Target
Sodium-dependent dopamine transporter
Ligand
BDBM85616
Substrate
Ki
1.53±n/a nM
Comments
PDSP_3137
Citation
 Goodman, MMKilts, CDKeil, RShi, BMartarello, LXing, DVotaw, JEly, TDLambert, POwens, MJCamp, VMMalveaux, EHoffman, JM 18F-labeled FECNT: a selective radioligand for PET imaging of brain dopamine transporters. Nucl Med Biol 27:1-12 (2000)  
Target
Name:
Sodium-dependent dopamine transporter
Synonyms:
DA transporter DAT1 Dopamine transporter protein (DAT) SC6A3_HUMAN Sodium-dependent dopamine transporter Solute carrier family 6 member 3
Type:
Multi-pass membrane protein
Mol. Mass.:
68497.11
Organism:
Homo sapiens (Human)
Description:
Q01959
Residue:
620
  
Inhibitor
Name:
BDBM85616
Synonyms:
MOLI000038 | [18F]FECNT
Type:
Small organic molecule
Emp. Form.:
C17H21ClFNO2
Mol. Mass.:
325.806
SMILES:
[H]C12CCC([H])(C(C(C1)c1ccc(Cl)cc1)C(=O)OC)N2CCF
: