Target
Adenosine receptor A3
Ligand
BDBM50006730
Substrate
Ki
>10000±n/a nM
Comments
PDSP_1738
Citation
 Varani, KMerighi, SGessi, SKlotz, KNLeung, EBaraldi, PGCacciari, BRomagnoli, RSpalluto, GBorea, PA [(3)H]MRE 3008F20: a novel antagonist radioligand for the pharmacological and biochemical characterization of human A(3) adenosine receptors. Mol Pharmacol 57:968-75 (2000) Target
Name:
Adenosine receptor A3
Synonyms:
A3 adenosine receptor (hA3) ADORA3 | Adenosine A3 receptor (A3AR)
Type:
G Protein-Coupled Receptor (GPCR)
Mol. Mass.:
36197.32
Organism:
Homo sapiens (Human)
Description:
P0DMS8
Residue:
318
  
Inhibitor
Name:
BDBM50006730
Synonyms:
(R)-2-Hydroxymethyl-5-[6-(1-methyl-2-phenyl-ethylamino)-purin-9-yl]-tetrahydro-furan-3,4-diol (S)-2-Hydroxymethyl-5-[6-(1-methyl-2-phenyl-ethylamino)-purin-9-yl]-tetrahydro-furan-3,4-diol 2-Hydroxymethyl-5-[6-(1-methyl-2-phenyl-ethylamino)-purin-9-yl]-tetrahydro-furan-3,4-diol ChEMBL_20163 L-2-Hydroxymethyl-5-[6-(1-methyl-2-phenyl-ethylamino)-purin-9-yl]-tetrahydro-furan-3,4-diol R-PIA | S-PIA
Type:
Small organic molecule
Emp. Form.:
C19H23N5O4
Mol. Mass.:
385.417
SMILES:
CC(Cc1ccccc1)Nc1ncnc2n(cnc12)C1OC(CO)C(O)C1O
: