Target
Proto-oncogene tyrosine-protein kinase Src
Ligand
BDBM85623
Substrate
Meas. Tech.
Tyrosine Kinase Assay
Temperature
310.15±0 K
IC50
2.1501e+5±n/a nM
Citation
 Olgen, SAkaho, ENebioglu, D Evaluation of indole esters as inhibitors of p60(c-Src) receptor tyrosine kinase and investigation of the inhibition using receptor docking studies. J Enzyme Inhib Med Chem 18:485-90 (2003)  
Target
Name:
Proto-oncogene tyrosine-protein kinase Src
Synonyms:
Proto-oncogene c-Src SRC_CHICK c-Src p60c-src | pp60c-src
Type:
Tyr protein kinase
Mol. Mass.:
60015.36
Organism:
Gallus gallus (Chicken)
Description:
P00523
Residue:
533
  
Inhibitor
Name:
BDBM85623
Synonyms:
Indole ester derivative, 3 | Indole ester derivative, 8
Type:
Small organic molecule
Emp. Form.:
C26H24N4O2
Mol. Mass.:
424.4944
SMILES:
O=C(OCCN(n1cccc1)n1cccc1)c1cc2ccccc2n1Cc1ccccc1
: