Target
Proto-oncogene tyrosine-protein kinase Src
Ligand
BDBM85625
Substrate
Meas. Tech.
Tyrosine Kinase Assay
Temperature
310.15±0 K
IC50
>1.000e+6±n/a nM
Citation
 Olgen, SAkaho, ENebioglu, D Evaluation of indole esters as inhibitors of p60(c-Src) receptor tyrosine kinase and investigation of the inhibition using receptor docking studies. J Enzyme Inhib Med Chem 18:485-90 (2003)  
Target
Name:
Proto-oncogene tyrosine-protein kinase Src
Synonyms:
Proto-oncogene c-Src SRC_CHICK c-Src p60c-src | pp60c-src
Type:
Tyr protein kinase
Mol. Mass.:
60015.36
Organism:
Gallus gallus (Chicken)
Description:
P00523
Residue:
533
  
Inhibitor
Name:
BDBM85625
Synonyms:
Indole ester derivative, 10 | Indole ester derivative, 5
Type:
Small organic molecule
Emp. Form.:
C21H24N2O2
Mol. Mass.:
336.4275
SMILES:
CC(CN(C)C)OC(=O)c1cc2ccccc2n1Cc1ccccc1
: