Target
Chymase
Ligand
BDBM85670
Substrate
Meas. Tech.
Enzyme Inhibition Assay
IC50
1.754e+4± 8.8e+3 nM
Citation
 Alagille, DPfeiffer, BScalbert, EFerry, GBoutin, JARenard, PViaud-Massuard, MC Design and synthesis of indole and tetrahydroisoquinoline hydantoin derivatives as human chymase inhibitors. J Enzyme Inhib Med Chem 19:137-43 (2004)  
Target
Name:
Chymase
Synonyms:
Alpha-chymase CMA1_HUMAN CYM Mast cell protease I
Type:
Enzyme
Mol. Mass.:
27340.12
Organism:
Homo sapiens (Human)
Description:
Residue:
247
  
Inhibitor
Name:
BDBM85670
Synonyms:
Tetrahydroisoquinoline hydantoin derivative, 5d
Type:
Small organic molecule
Emp. Form.:
C21H16N2O4S
Mol. Mass.:
392.428
SMILES:
Oc1c2Cc3ccccc3Cn2c(=O)n1S(=O)(=O)c1ccc2ccccc2c1
: