Target
5-hydroxytryptamine receptor 7
Ligand
BDBM50001775
Substrate
Ki
19.95±n/a nM
Comments
PDSP_1602
Citation
 Glusa, EPertz, HH Further evidence that 5-HT-induced relaxation of pig pulmonary artery is mediated by endothelial 5-HT(2B) receptors. Br J Pharmacol 130:692-8 (2000)  
Target
Name:
5-hydroxytryptamine receptor 7
Synonyms:
5-HT-7 5-HT7 5-HT7S 5-hydroxytryptamine receptor 7 5HT7R_RAT GPRFO Serotonin (5-HT) receptor | Serotonin Receptor 7
Type:
G Protein-Coupled Receptor (GPCR)
Mol. Mass.:
49852.62
Organism:
Rattus norvegicus (rat)
Description:
Rat cloned 5-HT7R.
Residue:
448
  
Inhibitor
Name:
BDBM50001775
Synonyms:
(ritanserin)6-(2-{4-[Bis-(4-fluoro-phenyl)-methylene]-piperidin-1-yl}-ethyl)-7-methyl-2,3-dihydro-1H-indolizin-5-one 6-(2-(4-(bis(4-fluorophenyl)methylene)piperidin-1-yl)ethyl)-7-methyl-5H-thiazolo[3,2-a]pyrimidin-5-one 6-(2-{4-[Bis-(4-fluoro-phenyl)-methylene]-piperidin-1-yl}-ethyl)-7-methyl-thiazolo[3,2-a]pyrimidin-5-one 6-(2-{4-[Bis-(4-fluoro-phenyl)-methylene]-piperidin-1-yl}-ethyl)-7-methyl-thiazolo[3,2-a]pyrimidin-5-one(Ritanserin) RITANSERIN cid_5074
Type:
Small organic molecule
Emp. Form.:
C27H25F2N3OS
Mol. Mass.:
477.569
SMILES:
[#6]-c1nc2sccn2c(=O)c1-[#6]-[#6]-[#7]-1-[#6]-[#6]\[#6](-[#6]-[#6]-1)=[#6](\c1ccc(F)cc1)-c1ccc(F)cc1
: