Target
Cannabinoid receptor 1
Ligand
BDBM85675
Substrate
Ki
2398±n/a nM
Comments
PDSP_3416
Citation
 Soderstrom, KLeid, MMoore, FLMurray, TF Behaviroal, pharmacological, and molecular characterization of an amphibian cannabinoid receptor. J Neurochem 75:413-23 (2000)  
Target
Name:
Cannabinoid receptor 1
Synonyms:
CANNABINOID CB1 CNR1_TARGR
Type:
Enzyme Catalytic Domain
Mol. Mass.:
53332.86
Organism:
Newt
Description:
CANNABINOID CB1 CNR1 Newt::Q9PUI7
Residue:
473
  
Inhibitor
Name:
BDBM85675
Synonyms:
Anandamide + PMSF | CHEMBL321585
Type:
Small organic molecule
Emp. Form.:
C24H41NO2
Mol. Mass.:
375.5878
SMILES:
CCCCC\C=C/C\C=C/C\C=C/C\C=C/CCCCCC(=O)NCCO
: