Target
D(2) dopamine receptor
Ligand
BDBM50050467
Substrate
Ki
3.98±n/a nM
Comments
PDSP_3305
Citation
 Millan, MJGobert, ANewman-Tancredi, ALejeune, FCussac, DRivet, JMAudinot, VDubuffet, TLavielle, G S33084, a novel, potent, selective, and competitive antagonist at dopamine D(3)-receptors: I. Receptorial, electrophysiological and neurochemical profile compared with GR218,231 and L741,626. J Pharmacol Exp Ther 293:1048-62 (2000) Target
Name:
D(2) dopamine receptor
Synonyms:
D(2) dopamine receptor DOPAMINE D2 Long DRD2 Dopamine D2 receptor Dopamine D2 receptor (D2R) Dopamine2-like | d2
Type:
Cell-surface receptors
Mol. Mass.:
50647.10
Organism:
Homo sapiens (Human)
Description:
P14416
Residue:
443
  
Inhibitor
Name:
BDBM50050467
Synonyms:
1-((1H-indol-3-yl)methyl)-4-(4-chlorophenyl)piperidin-4-ol 4-(4-Chloro-phenyl)-1-(1H-indol-3-ylmethyl)-piperidin-4-ol L-741626 | L741,626
Type:
Small organic molecule
Emp. Form.:
C20H21ClN2O
Mol. Mass.:
340.847
SMILES:
OC1(CCN(Cc2c[nH]c3ccccc23)CC1)c1ccc(Cl)cc1
: